Target
Histone-lysine N-methyltransferase EHMT2
Ligand
BDBM50442103
Substrate
Meas. Tech.
ChEMBL_992763 (CHEMBL2443912)
IC50
40±n/a nM
Citation
 Liu, FBarsyte-Lovejoy, DLi, FXiong, YKorboukh, VHuang, XPAllali-Hassani, AJanzen, WPRoth, BLFrye, SVArrowsmith, CHBrown, PJVedadi, MJin, J Discovery of an in vivo chemical probe of the lysine methyltransferases G9a and GLP. J Med Chem 56:8931-42 (2013)  
Target
Name:
Histone-lysine N-methyltransferase EHMT2
Synonyms:
BAT8 EHMT2 G9A Histone-lysine N-methyltransferase EHMT1/EHMT2 KMT1C Protein G9a (G9a)
Type:
Enzyme
Mol. Mass.:
132339.87
Organism:
Homo sapiens (Human)
Description:
Q96KQ7
Residue:
1210
  
Inhibitor
Name:
BDBM50442103
Synonyms:
CHEMBL2441082
Type:
Small organic molecule
Emp. Form.:
C29H44F2N6O2
Mol. Mass.:
546.6955
SMILES:
COc1cc2c(NC3CCN(CC3)C(C)C)nc(nc2cc1OCCCN1CCCC1)N1CCC(F)(F)CC1
: