Target
Sialidase
Ligand
BDBM50442400
Substrate
Meas. Tech.
ChEMBL_991337 (CHEMBL2443546)
Ki
130±n/a nM
Citation
 Wang, YCurtis-Long, MJYuk, HJKim, DWTan, XFPark, KH Bacterial neuraminidase inhibitory effects of prenylated isoflavones from roots of Flemingia philippinensis. Bioorg Med Chem 21:6398-404 (2013)  
Target
Name:
Sialidase
Synonyms:
NANH_CLOPF | nanH
Type:
PROTEIN
Mol. Mass.:
42808.79
Organism:
Clostridium perfringens
Description:
ChEMBL_991336
Residue:
382
  
Inhibitor
Name:
BDBM50442400
Synonyms:
AURICULASIN
Type:
Small organic molecule
Emp. Form.:
C25H24O6
Mol. Mass.:
420.4545
SMILES:
[#6]\[#6](-[#6])=[#6]\[#6]-c1c2-[#8]C([#6])([#6])[#6]=[#6]-c2c(-[#8])c2c1occ(-c1ccc(-[#8])c(-[#8])c1)c2=O
: