Target
Sodium/glucose cotransporter 1
Ligand
BDBM20875
Substrate
Meas. Tech.
ChEMBL_990144 (CHEMBL2444339)
EC50
120±n/a nM
Citation
 Lin, TSLiw, YWSong, JSHsieh, TCYeh, HWHsu, LCLin, CJWu, SHLiang, PH Synthesis and biological evaluation of novel C-aryl d-glucofuranosides as sodium-dependent glucose co-transporter 2 inhibitors. Bioorg Med Chem 21:6282-91 (2013)  
Target
Name:
Sodium/glucose cotransporter 1
Synonyms:
High affinity sodium-glucose cotransporter Na(+)/glucose cotransporter 1 SGLT1 Sodium-dependent glucose cotransporter 1 (SGLT1) Sodium/glucose cotransporter 1 (SGLT1) | Solute carrier family 5 member 1
Type:
Protein
Mol. Mass.:
73503.78
Organism:
Homo sapiens (Human)
Description:
P13866
Residue:
664
  
Inhibitor
Name:
BDBM20875
Synonyms:
1-(2,4-dihydroxy-6-{[(2S,3R,4S,5S,6R)-3,4,5-trihydroxy-6-(hydroxymethyl)oxan-2-yl]oxy}phenyl)-3-(4-hydroxyphenyl)propan-1-one CHEMBL245067 O-glucoside, 1 | Phlorizin
Type:
Natural product
Emp. Form.:
C21H24O10
Mol. Mass.:
436.4093
SMILES:
OC[C@H]1O[C@@H](Oc2cc(O)cc(O)c2C(=O)CCc2ccc(O)cc2)[C@H](O)[C@@H](O)[C@@H]1O
: