Target
Rho-associated protein kinase 2
Ligand
BDBM50442812
Substrate
Meas. Tech.
ChEMBL_990098 (CHEMBL2444040)
IC50
1.4±n/a nM
Citation
 Boland, SDefert, OAlen, JBourin, ACastermans, KKindt, NBoumans, NPanitti, LVan de Velde, SStalmans, ILeysen, D 3-[2-(Aminomethyl)-5-[(pyridin-4-yl)carbamoyl]phenyl] benzoates as soft ROCK inhibitors. Bioorg Med Chem Lett 23:6442-6 (2013)  
Target
Name:
Rho-associated protein kinase 2
Synonyms:
KIAA0619 ROCK2 Rho kinase 2 (ROCKII) Rho-associated protein kinase 2 (ROCK2) Rho-associated protein kinase 2/Transforming protein RhoA Rho-associated, coiled-coil-containing protein kinase II p164 ROCK-2
Type:
Protein
Mol. Mass.:
160885.43
Organism:
Homo sapiens (Human)
Description:
O75116
Residue:
1388
  
Inhibitor
Name:
BDBM50442812
Synonyms:
CHEMBL2440735
Type:
Small organic molecule
Emp. Form.:
C22H20FN3O4
Mol. Mass.:
409.4103
SMILES:
NCc1ccc(cc1-c1cccc(c1)C(=O)OCCO)C(=O)Nc1ccncc1F
: