Target
Rho-associated protein kinase 2
Ligand
BDBM50442815
Substrate
Meas. Tech.
ChEMBL_990098 (CHEMBL2444040)
IC50
5.5±n/a nM
Citation
 Boland, SDefert, OAlen, JBourin, ACastermans, KKindt, NBoumans, NPanitti, LVan de Velde, SStalmans, ILeysen, D 3-[2-(Aminomethyl)-5-[(pyridin-4-yl)carbamoyl]phenyl] benzoates as soft ROCK inhibitors. Bioorg Med Chem Lett 23:6442-6 (2013)  
Target
Name:
Rho-associated protein kinase 2
Synonyms:
KIAA0619 ROCK2 Rho kinase 2 (ROCKII) Rho-associated protein kinase 2 (ROCK2) Rho-associated protein kinase 2/Transforming protein RhoA Rho-associated, coiled-coil-containing protein kinase II p164 ROCK-2
Type:
Protein
Mol. Mass.:
160885.43
Organism:
Homo sapiens (Human)
Description:
O75116
Residue:
1388
  
Inhibitor
Name:
BDBM50442815
Synonyms:
CHEMBL2440746
Type:
Small organic molecule
Emp. Form.:
C24H25N3O3
Mol. Mass.:
403.4736
SMILES:
CCCCOC(=O)c1cccc(c1)-c1cc(ccc1CN)C(=O)Nc1ccncc1
: