Target
KiSS-1 receptor
Ligand
BDBM50442976
Substrate
Meas. Tech.
ChEMBL_1276486 (CHEMBL3088610)
Ki
0.120000±n/a nM
Citation
 Asami, TNishizawa, NMatsui, HNishibori, KIshibashi, YHorikoshi, YNakayama, MMatsumoto, STarui, NYamaguchi, MMatsumoto, HOhtaki, TKitada, C Design, synthesis, and biological evaluation of novel investigational nonapeptide KISS1R agonists with testosterone-suppressive activity. J Med Chem 56:8298-307 (2013)  
Target
Name:
KiSS-1 receptor
Synonyms:
AXOR12 G-protein coupled receptor 54 (GPR54) Hypogonadotropin-1 KISSR_HUMAN Kisspeptins receptor hOT7T175
Type:
G Protein-Coupled Receptor (GPCR)
Mol. Mass.:
42613.79
Organism:
Homo sapiens (Human)
Description:
Binding assay was performed using membranes from the CHO cell transfectants.
Residue:
398
  
Inhibitor
Name:
BDBM50442976
Synonyms:
CHEMBL3086280
Type:
Small organic molecule
Emp. Form.:
C54H79N15O12
Mol. Mass.:
1130.2984
SMILES:
CC[C@H](C)[C@H](NC(=O)[C@H](N)Cc1ccc(O)cc1)C(=O)N[C@@H](CC(N)=O)C(=O)N[C@@H](CO)C(=O)N[C@@H](Cc1ccccc1)C(=O)NNC(=O)N[C@@H](CC(C)C)C(=O)N[C@@H](CCCN=C(N)NC)C(=O)N[C@@H](Cc1ccccc1)C(N)=O
: