Target
Mineralocorticoid receptor
Ligand
BDBM50443329
Substrate
Meas. Tech.
ChEMBL_1275507 (CHEMBL3090522)
Ki
113±n/a nM
Citation
 Futatsugi, KPiotrowski, DWCasimiro-Garcia, ARobinson, SSammons, MLoria, PMBanker, MEPetersen, DNSchmidt, NJ Design and synthesis of aryl sulfonamide-based nonsteroidal mineralocorticoid receptor antagonists. Bioorg Med Chem Lett 23:6239-42 (2013)  
Target
Name:
Mineralocorticoid receptor
Synonyms:
MCR MLR NR3C2 | Nuclear receptor subfamily 3 group C member 2
Type:
Enzyme
Mol. Mass.:
107076.42
Organism:
Homo sapiens (Human)
Description:
P08235
Residue:
984
  
Inhibitor
Name:
BDBM50443329
Synonyms:
CHEMBL3086027
Type:
Small organic molecule
Emp. Form.:
C18H17F2N3O2S
Mol. Mass.:
377.408
SMILES:
Cc1cn(c(C)n1)-c1ccc(CNS(=O)(=O)c2cc(F)ccc2F)cc1
: