Target
Cyclin-A2/Cyclin-dependent kinase 2
Ligand
BDBM50443452
Substrate
Meas. Tech.
ChEMBL_1274641 (CHEMBL3089977)
Ki
68±n/a nM
Citation
 Shao, HShi, SFoley, DWLam, FAbbas, AYLiu, XHuang, SJiang, XBaharin, NFischer, PMWang, S Synthesis, structure-activity relationship and biological evaluation of 2,4,5-trisubstituted pyrimidine CDK inhibitors as potential anti-tumour agents. Eur J Med Chem 70:447-55 (2013)  
Target
Name:
Cyclin-A2/Cyclin-dependent kinase 2
Synonyms:
CDK2-CyclinA CDK2/Cyclin A Cyclin A2/dependent kinase 2 Cyclin-Dependent Kinase 2 (CDK2A)
Type:
Protein Complex
Mol. Mass.:
Description:
Cdk2/Cyclin A kinase was purified from insect cells coinfected with Cyclin A/Cdk2 baculovirus.
Components:
This complex has 2 components.
Component 1
Name:
Cyclin-dependent kinase 2
Synonyms:
CDK2 CDK2_HUMAN Cell division protein kinase 2 Protein cereblon/Cyclin-dependent kinase 2 | p33 protein kinase
Type:
Enzyme Subunit
Mol. Mass.:
33938.17
Organism:
Homo sapiens (Human)
Description:
P24941
Residue:
298
  
Component 2
Name:
Cyclin-A2
Synonyms:
CCN1 CCNA1 CCNA2_HUMAN Cyclin-A
Type:
Enzyme Subunit
Mol. Mass.:
48550.19
Organism:
Homo sapiens (Human)
Description:
P20248
Residue:
432
  
Inhibitor
Name:
BDBM50443452
Synonyms:
CHEMBL3087445
Type:
Small organic molecule
Emp. Form.:
C19H22FN7S
Mol. Mass.:
399.488
SMILES:
CN1CCN(CC1)c1cccc(Nc2ncc(F)c(n2)-c2sc(N)nc2C)c1
: