Target
Aurora kinase A
Ligand
BDBM50444594
Substrate
Meas. Tech.
ChEMBL_1282260 (CHEMBL3102609)
IC50
>40000±n/a nM
Citation
 Ye, QShen, YZhou, YLv, DGao, JLi, JHu, Y Design, synthesis and evaluation of 7-azaindazolyl-indolyl-maleimides as glycogen synthase kinase-3ß (GSK-3ß) inhibitors. Eur J Med Chem 68:361-71 (2013)  
Target
Name:
Aurora kinase A
Synonyms:
AIK ARK-1 AURA AURKA_HUMAN Aurora 2 Aurora kinase A (AURKA) Aurora kinase A (Aurora-2) Aurora/IPL1-related kinase 1 Breast tumor-amplified kinase IAK1 STK15 GN Serine/threonine kinase 15 Serine/threonine-protein kinase 6 Serine/threonine-protein kinase aurora-A aurora-2 | hARK1
Type:
Serine/threonine-protein kinase
Mol. Mass.:
45830.98
Organism:
Homo sapiens (Human)
Description:
O14965
Residue:
403
  
Inhibitor
Name:
BDBM50444594
Synonyms:
CHEMBL3099832
Type:
Small organic molecule
Emp. Form.:
C25H24N6O3
Mol. Mass.:
456.4965
SMILES:
Cn1cc(C2=C(C(=O)NC2=O)c2nn(CCN3CCOCC3)c3ncccc23)c2ccccc12
: