Target
Inhibitor of nuclear factor kappa-B kinase subunit beta
Ligand
BDBM50444595
Substrate
Meas. Tech.
ChEMBL_1282261 (CHEMBL3102610)
IC50
>40000±n/a nM
Citation
 Ye, QShen, YZhou, YLv, DGao, JLi, JHu, Y Design, synthesis and evaluation of 7-azaindazolyl-indolyl-maleimides as glycogen synthase kinase-3ß (GSK-3ß) inhibitors. Eur J Med Chem 68:361-71 (2013)  
Target
Name:
Inhibitor of nuclear factor kappa-B kinase subunit beta
Synonyms:
I-kappa-B Kinase 2 (IKK-beta) I-kappa-B-kinase beta IKBKB IKK-beta IKK2/IKK1 IKKB_HUMAN Inhibitor of nuclear factor kappa B kinase beta subunit Nuclear factor NF-kappa-B inhibitor kinase beta
Type:
Serine/threonine-protein kinase
Mol. Mass.:
86554.39
Organism:
Homo sapiens (Human)
Description:
GST-tagged IKK-2 was expressed in High Five cells and purified.
Residue:
756
  
Inhibitor
Name:
BDBM50444595
Synonyms:
CHEMBL563560
Type:
Small organic molecule
Emp. Form.:
C24H19N7O2
Mol. Mass.:
437.4534
SMILES:
Cn1cc(C2=C(C(=O)NC2=O)c2nn(CCn3ccnc3)c3ncccc23)c2ccccc12
: