Target
Biotin--[biotin carboxyl-carrier protein] ligase
Ligand
BDBM50445155
Substrate
Meas. Tech.
ChEMBL_1284455 (CHEMBL3106343)
Kd
0.04±n/a nM
Citation
 Shi, CTiwari, DWilson, DJSeiler, CLSchnappinger, DAldrich, CC Bisubstrate Inhibitors of Biotin Protein Ligase in ACS Med Chem Lett 4:1213-7 (2013)  
Target
Name:
Biotin--[biotin carboxyl-carrier protein] ligase
Synonyms:
BirA bifunctional protein | birA
Type:
PROTEIN
Mol. Mass.:
28120.21
Organism:
Mycobacterium tuberculosis (strain CDC 1551 / Oshkosh)
Description:
ChEMBL_107988
Residue:
266
  
Inhibitor
Name:
BDBM50445155
Synonyms:
CHEMBL3103889
Type:
Small organic molecule
Emp. Form.:
C21H28N7O8S2
Mol. Mass.:
570.62
SMILES:
Nc1nccc2n(cnc12)[C@@H]1O[C@H](COS(=O)(=O)[N-]C(=O)CCCC[C@@H]2SC[C@@H]3NC(=O)N[C@H]23)[C@@H](O)[C@H]1O
: