Target
Calmodulin-domain protein kinase 1
Ligand
BDBM50446172
Substrate
Meas. Tech.
ChEMBL_1287980 (CHEMBL3110679)
IC50
7.0±n/a nM
Citation
 Zhang, ZOjo, KKVidadala, RHuang, WGeiger, JAScheele, SChoi, RReid, MCKeyloun, KRRivas, KSiddaramaiah, LKComess, KMRobinson, KPMerta, PJKifle, LHol, WGParsons, MMerritt, EAMaly, DJVerlinde, CLVan Voorhis, WCFan, E Potent and selective inhibitors of CDPK1 from ACS Med Chem Lett 5:40-44 (2014)  
Target
Name:
Calmodulin-domain protein kinase 1
Synonyms:
Calmodulin-domain protein kinase 1 Calmodulin-domain protein kinase, putative
Type:
Enzyme Catalytic Domain
Mol. Mass.:
57248.42
Organism:
Toxoplasma gondii
Description:
Residue:
507
  
Inhibitor
Name:
BDBM50446172
Synonyms:
CHEMBL3108997 US9956214, Compound 24
Type:
Small organic molecule
Emp. Form.:
C18H20N4O2
Mol. Mass.:
324.377
SMILES:
CC(C)(C)n1nc(c(C(N)=O)c1N)-c1ccc2cc(O)ccc2c1
: