Target
Arginase
Ligand
BDBM50446569
Substrate
Meas. Tech.
ChEMBL_1286565 (CHEMBL3110798)
IC50
16600±n/a nM
Citation
 de Sousa, LRRamalho, SDBurger, MCNebo, LFernandes, JBda Silva, MFIemma, MRCorrêa, CJde Souza, DHLima, MIVieira, PC Isolation of arginase inhibitors from the bioactivity-guided fractionation of Byrsonima coccolobifolia leaves and stems. J Nat Prod 77:392-6 (2014)  
Target
Name:
Arginase
Synonyms:
Type:
PROTEIN
Mol. Mass.:
36149.67
Organism:
Leishmania amazonensis
Description:
ChEMBL_107995
Residue:
329
  
Inhibitor
Name:
BDBM50446569
Synonyms:
Trigonostemone
Type:
Small organic molecule
Emp. Form.:
C20H22O4
Mol. Mass.:
326.3863
SMILES:
COC1=Cc2c(cc(OC)c3cc(C)c(OC)cc23)C(C)(C)C1=O
: