Target
Arginase
Ligand
BDBM50446567
Substrate
Meas. Tech.
ChEMBL_1286565 (CHEMBL3110798)
IC50
900±n/a nM
Citation
 de Sousa, LRRamalho, SDBurger, MCNebo, LFernandes, JBda Silva, MFIemma, MRCorrêa, CJde Souza, DHLima, MIVieira, PC Isolation of arginase inhibitors from the bioactivity-guided fractionation of Byrsonima coccolobifolia leaves and stems. J Nat Prod 77:392-6 (2014)  
Target
Name:
Arginase
Synonyms:
Type:
PROTEIN
Mol. Mass.:
36149.67
Organism:
Leishmania amazonensis
Description:
ChEMBL_107995
Residue:
329
  
Inhibitor
Name:
BDBM50446567
Synonyms:
CHEMBL3109443
Type:
Small organic molecule
Emp. Form.:
C21H18O10
Mol. Mass.:
430.3616
SMILES:
CC(=O)O[C@H]1[C@@H](Oc2cc(OC(C)=O)cc(OC(C)=O)c2C1=O)c1ccc(O)c(O)c1
: