Target
Arginase
Ligand
BDBM50446573
Substrate
Meas. Tech.
ChEMBL_1286565 (CHEMBL3110798)
IC50
127900±n/a nM
Citation
 de Sousa, LRRamalho, SDBurger, MCNebo, LFernandes, JBda Silva, MFIemma, MRCorrêa, CJde Souza, DHLima, MIVieira, PC Isolation of arginase inhibitors from the bioactivity-guided fractionation of Byrsonima coccolobifolia leaves and stems. J Nat Prod 77:392-6 (2014)  
Target
Name:
Arginase
Synonyms:
Type:
PROTEIN
Mol. Mass.:
36149.67
Organism:
Leishmania amazonensis
Description:
ChEMBL_107995
Residue:
329
  
Inhibitor
Name:
BDBM50446573
Synonyms:
CHEMBL3109440
Type:
Small organic molecule
Emp. Form.:
C22H24O9
Mol. Mass.:
432.4206
SMILES:
COc1cc(cc(OC)c1OC)-c1oc2cc(OC)c(OC)c(OC)c2c(=O)c1OC
: