Target
Arginase
Ligand
BDBM50404746
Substrate
Meas. Tech.
ChEMBL_1286565 (CHEMBL3110798)
IC50
120800±n/a nM
Citation
 de Sousa, LRRamalho, SDBurger, MCNebo, LFernandes, JBda Silva, MFIemma, MRCorrêa, CJde Souza, DHLima, MIVieira, PC Isolation of arginase inhibitors from the bioactivity-guided fractionation of Byrsonima coccolobifolia leaves and stems. J Nat Prod 77:392-6 (2014)  
Target
Name:
Arginase
Synonyms:
Type:
PROTEIN
Mol. Mass.:
36149.67
Organism:
Leishmania amazonensis
Description:
ChEMBL_107995
Residue:
329
  
Inhibitor
Name:
BDBM50404746
Synonyms:
NSC-115919 | PENTAACETYLQUERCETIN
Type:
Small organic molecule
Emp. Form.:
C25H20O12
Mol. Mass.:
512.4191
SMILES:
CC(=O)Oc1cc(OC(C)=O)c2c(c1)oc(-c1ccc(OC(C)=O)c(OC(C)=O)c1)c(OC(C)=O)c2=O
: