Target
Arginase
Ligand
BDBM50446568
Substrate
Meas. Tech.
ChEMBL_1286565 (CHEMBL3110798)
IC50
2400±n/a nM
Citation
 de Sousa, LRRamalho, SDBurger, MCNebo, LFernandes, JBda Silva, MFIemma, MRCorrêa, CJde Souza, DHLima, MIVieira, PC Isolation of arginase inhibitors from the bioactivity-guided fractionation of Byrsonima coccolobifolia leaves and stems. J Nat Prod 77:392-6 (2014)  
Target
Name:
Arginase
Synonyms:
Type:
PROTEIN
Mol. Mass.:
36149.67
Organism:
Leishmania amazonensis
Description:
ChEMBL_107995
Residue:
329
  
Inhibitor
Name:
BDBM50446568
Synonyms:
CHEMBL3109439
Type:
Small organic molecule
Emp. Form.:
C21H20O12
Mol. Mass.:
464.3763
SMILES:
C[C@H]1O[C@H](Oc2c(O)c3c(cc(O)cc3=O)oc2-c2cc(O)c(O)c(O)c2)[C@@H](O)[C@@H](O)[C@@H]1O
: