Target
Integrin alpha-2/beta-1
Ligand
BDBM50446815
Substrate
Meas. Tech.
ChEMBL_1290037 (CHEMBL3116955)
IC50
470±n/a nM
Citation
 Halland, NBlum, HBuning, CKohlmann, MLindenschmidt, A Small Macrocycles As Highly Active Integrin?2?1 Antagonists. ACS Med Chem Lett 5:193-8 (2014)  
Target
Name:
Integrin alpha-2/beta-1
Synonyms:
Integrin alpha2/beta1
Type:
Mol. Mass.:
Description:
ASSAY_ID of ChEMBL is 1971731
Components:
This complex has 2 components.
Component 1
Name:
Integrin beta-1
Synonyms:
CD_antigen=CD29 Fibronectin receptor beta GPIIA ITGB1 MDF2 | MSK12
Type:
Enzyme
Mol. Mass.:
88400.38
Organism:
Homo sapiens (Human)
Description:
P05556
Residue:
798
  
Component 2
Name:
Integrin alpha-2
Synonyms:
CD49B Collagen receptor ITA2_HUMAN Integrin alpha-2 precursor Platelet membrane glycoprotein Ia | VLA-2 alpha chain
Type:
Single-pass type I membrane protein
Mol. Mass.:
129273.27
Organism:
Homo sapiens (Human)
Description:
Residue:
1181
  
Inhibitor
Name:
BDBM50446815
Synonyms:
CHEMBL3115063
Type:
Small organic molecule
Emp. Form.:
C17H16ClN3O4
Mol. Mass.:
361.78
SMILES:
OC(=O)[C@@H]1Cc2cn(C\C=C\COc3ccc(c(Cl)c3)C(=O)N1)cn2
: