Target
Intestinal-type alkaline phosphatase
Ligand
BDBM50447424
Substrate
Meas. Tech.
ChEMBL_1288277 (CHEMBL3117560)
IC50
4200±n/a nM
Citation
 Ardecky, RJBobkova, EVKiffer-Moreira, TBrown, BGanji, SZou, JPass, INarisawa, SIano, FGRosenstein, CCheltsov, ARascon, JHedrick, MGasior, CForster, AShi, SDahl, RVasile, SSu, YSergienko, EChung, TDKaunitz, JHoylaerts, MFPinkerton, ABMillán, JL Identification of a selective inhibitor of murine intestinal alkaline phosphatase (ML260) by concurrent ultra-high throughput screening against human and mouse isozymes. Bioorg Med Chem Lett 24:1000-4 (2014)  
Target
Name:
Intestinal-type alkaline phosphatase
Synonyms:
Akp-3 Iap PPBI_MOUSE
Type:
PROTEIN
Mol. Mass.:
60286.13
Organism:
Mus musculus
Description:
ChEMBL_1288277
Residue:
559
  
Inhibitor
Name:
BDBM50447424
Synonyms:
CHEMBL3115139
Type:
Small organic molecule
Emp. Form.:
C19H21N3O6S
Mol. Mass.:
419.452
SMILES:
Oc1ccc(CCNC(=O)CCCNS(=O)(=O)c2ccc3[nH]c(=O)oc3c2)cc1
: