Target
Retinoic acid receptor alpha
Ligand
BDBM50447840
Substrate
Meas. Tech.
ChEMBL_1290846 (CHEMBL3118431)
IC50
114±n/a nM
Citation
 García-Rodríguez, JPérez-Rodríguez, SOrtiz, MAPereira, Rde Lera, ARPiedrafita, FJ Inhibition of I¿B kinase-ß and I¿B kinase-a by heterocyclic adamantyl arotinoids. Bioorg Med Chem 22:1285-302 (2014)  
Target
Name:
Retinoic acid receptor alpha
Synonyms:
NR1B1 RAR-alpha RARA_HUMAN Retinoic acid receptor alpha/Retinoid X receptor alpha Retinoid receptor
Type:
PROTEIN
Mol. Mass.:
50778.87
Organism:
Homo sapiens (Human)
Description:
ChEMBL_1466191
Residue:
462
  
Inhibitor
Name:
BDBM50447840
Synonyms:
BMS-204493 | CHEMBL472172
Type:
Small organic molecule
Emp. Form.:
C29H24O2
Mol. Mass.:
404.4997
SMILES:
CC1(C)CC=C(C#Cc2ccccc2)c2cc(\C=C\c3ccc(cc3)C(O)=O)ccc12
: