Target
E3 ubiquitin-protein ligase Mdm2
Ligand
BDBM50448947
Substrate
Meas. Tech.
ChEMBL_1296789 (CHEMBL3132472)
Kd
0.045000±n/a nM
Citation
 Sun, DLi, ZRew, YGribble, MBartberger, MDBeck, HPCanon, JChen, AChen, XChow, DDeignan, JDuquette, JEksterowicz, JFisher, BFox, BMFu, JGonzalez, AZGonzalez-Lopez De Turiso, FHouze, JBHuang, XJiang, MJin, LKayser, FLiu, JJLo, MCLong, AMLucas, BMcGee, LRMcIntosh, JMihalic, JOliner, JDOsgood, TPeterson, MLRoveto, PSaiki, AYShaffer, PToteva, MWang, YWang, YCWortman, SYakowec, PYan, XYe, QYu, DYu, MZhao, XZhou, JZhu, JOlson, SHMedina, JC Discovery of AMG 232, a potent, selective, and orally bioavailable MDM2-p53 inhibitor in clinical development. J Med Chem 57:1454-72 (2014)  
Target
Name:
E3 ubiquitin-protein ligase Mdm2
Synonyms:
Double minute 2 protein E3 ubiquitin-protein ligase Mdm2 (p53-binding protein Mdm2) Human Double Minute 2 (HDM2) MDM2-MDMX p53-Binding Protein MDM2 | p53-binding protein
Type:
Oncoprotein
Mol. Mass.:
55196.54
Organism:
Homo sapiens (Human)
Description:
Q00987
Residue:
491
  
Inhibitor
Name:
BDBM50448947
Synonyms:
CHEMBL3125702 US9593129, Example 362
Type:
Small organic molecule
Emp. Form.:
C28H35Cl2NO5S
Mol. Mass.:
568.552
SMILES:
CC(C)[C@@H](CS(=O)(=O)C(C)C)N1[C@@H]([C@H](C[C@](C)(CC(O)=O)C1=O)c1cccc(Cl)c1)c1ccc(Cl)cc1
: