Target
Adenosine receptor A2a
Ligand
BDBM7460
Substrate
Meas. Tech.
ChEMBL_30279 (CHEMBL640100)
Ki
6918±n/a nM
Citation
 Moro, Svan Rhee, AMSanders, LHJacobson, KA Flavonoid derivatives as adenosine receptor antagonists: a comparison of the hypothetical receptor binding site based on a comparative molecular field analysis model. J Med Chem 41:46-52 (1998)  
Target
Name:
Adenosine receptor A2a
Synonyms:
AA2AR_RAT Adenosine A2 receptor Adenosine Receptors A2a (A2a) Adenosine receptors A2a Rat striatal adenosine A2a receptor
Type:
G Protein-Coupled Receptor (GPCR)
Mol. Mass.:
45015.65
Organism:
Rattus norvegicus (rat)
Description:
Rat A2A receptors expressed in CHO cells.
Residue:
410
  
Inhibitor
Name:
BDBM7460
Synonyms:
2-(3,4-dihydroxyphenyl)-3,5,7-trihydroxy-4H-chromen-4-one 2-(3,4-dihydroxyphenyl)-3,5,7-trihydroxy-chromone;hydrate Quercetin Quercetin (21) US11021454, Compound Quercetin med.21724, Compound 4
Type:
Small organic molecule
Emp. Form.:
C15H10O7
Mol. Mass.:
302.2357
SMILES:
Oc1cc(O)c2c(c1)oc(-c1ccc(O)c(O)c1)c(O)c2=O
: