Target
Acetolactate synthase 2, chloroplastic
Ligand
BDBM50004747
Substrate
Meas. Tech.
ChEMBL_916417 (CHEMBL3082458)
IC50
9.4±n/a nM
Citation
 Namgoong, SKLee, HJKim, YSShin, JHChe, JKJang, DYKim, GSYoo, JWKang, MKKil, MWChoi, JDChang, SI Synthesis of the quinoline-linked triazolopyrimidine analogues and their interactions with the recombinant tobacco acetolactate synthase. Biochem Biophys Res Commun 258:797-801 (1999)  
Target
Name:
Acetolactate synthase 2, chloroplastic
Synonyms:
ALS SURB ILVB2_TOBAC
Type:
PROTEIN
Mol. Mass.:
72423.23
Organism:
Nicotiana tabacum
Description:
ChEMBL_106559
Residue:
664
  
Inhibitor
Name:
BDBM50004747
Synonyms:
CHEMBL2269036
Type:
Small organic molecule
Emp. Form.:
C16H13ClN6O2S
Mol. Mass.:
388.831
SMILES:
Cc1cc(C)n2nc(nc2n1)S(=O)(=O)Nc1c(Cl)ccc2cccnc12
: