Target
Neutral cholesterol ester hydrolase 1
Ligand
BDBM50012157
Substrate
Meas. Tech.
ChEMBL_1352949 (CHEMBL3269816)
IC50
>100000±n/a nM
Citation
 Duncan, KKOtrubova, KBoger, DL a-Ketoheterocycle inhibitors of fatty acid amide hydrolase: exploration of conformational constraints in the acyl side chain. Bioorg Med Chem 22:2763-70 (2014)  
Target
Name:
Neutral cholesterol ester hydrolase 1
Synonyms:
Aadacl1 CPO-BP Kiaa1363 NCEH1_MOUSE Neutral cholesterol ester hydrolase
Type:
Single-pass type II membrane protein; hydrolase
Mol. Mass.:
45742.11
Organism:
Mus musculus (mouse)
Description:
Assays were using membranes of recombinant KIAA1363 transiently transfected in COS-7 cells.
Residue:
408
  
Inhibitor
Name:
BDBM50012157
Synonyms:
CHEMBL3264462
Type:
Small organic molecule
Emp. Form.:
C24H18N2O4
Mol. Mass.:
398.4107
SMILES:
O=C(C1CCc2cc(Oc3ccccc3)ccc2O1)c1ncc(o1)-c1ccccn1
: