Target
11-beta-hydroxysteroid dehydrogenase 1
Ligand
BDBM50017008
Substrate
Meas. Tech.
ChEMBL_1364745 (CHEMBL3294006)
IC50
18±n/a nM
Citation
 Scott, JSGoldberg, FWTurnbull, AV Medicinal chemistry of inhibitors of 11ß-hydroxysteroid dehydrogenase type 1 (11ß-HSD1). J Med Chem 57:4466-86 (2014)  
Target
Name:
11-beta-hydroxysteroid dehydrogenase 1
Synonyms:
11-DH 11-beta-Hydroxysteroid Dehydrogenase 1 (11-beta-HSD1) 11beta-HSD1A Corticosteroid 11-beta-dehydrogenase isozyme 1 (11-beta-HSD-1) Hsd11 | Hsd11b1
Type:
Enzyme
Mol. Mass.:
32369.70
Organism:
Mus musculus (mouse)
Description:
P50172
Residue:
292
  
Inhibitor
Name:
BDBM50017008
Synonyms:
CHEMBL3287025
Type:
Small organic molecule
Emp. Form.:
C23H33ClN2O3S
Mol. Mass.:
453.038
SMILES:
[H][C@]12CC[C@](C)([C@H](C1)NC(=O)[C@H]1CCCN(C1)S(=O)(=O)c1cccc(Cl)c1C)C2(C)C
: