Target
Delta-aminolevulinic acid dehydratase
Ligand
BDBM50017187
Substrate
Meas. Tech.
ChEMBL_1365605 (CHEMBL3297386)
EC50
52000±n/a nM
Citation
 Lentz, CSHalls, VSHannam, JSStrassel, SLawrence, SHJaffe, EKFamulok, MHoerauf, APfarr, KM wALADin benzimidazoles differentially modulate the function of porphobilinogen synthase orthologs. J Med Chem 57:2498-510 (2014)  
Target
Name:
Delta-aminolevulinic acid dehydratase
Synonyms:
hemB
Type:
PROTEIN
Mol. Mass.:
37589.03
Organism:
Yersinia enterocolitica W22703
Description:
ChEMBL_108387
Residue:
340
  
Inhibitor
Name:
BDBM50017187
Synonyms:
CHEMBL3287363
Type:
Small organic molecule
Emp. Form.:
C23H18F3N3O3S
Mol. Mass.:
473.468
SMILES:
OC(=O)c1ccc2n(Cc3ccc(cc3)C(F)(F)F)c(CCNC(=O)c3cccs3)nc2c1
: