Target
Integrase
Ligand
BDBM7461
Substrate
Meas. Tech.
ChEMBL_1364392 (CHEMBL3294261)
IC50
>20000±n/a nM
Citation
 Li, BWZhang, FHSerrao, EChen, HSanchez, TWYang, LMNeamati, NZheng, YTWang, HLong, YQ Design and discovery of flavonoid-based HIV-1 integrase inhibitors targeting both the active site and the interaction with LEDGF/p75. Bioorg Med Chem 22:3146-58 (2014)  
Target
Name:
Integrase
Synonyms:
Human immunodeficiency virus type 1 integrase
Type:
PROTEIN
Mol. Mass.:
32231.48
Organism:
Human immunodeficiency virus 1
Description:
ChEMBL_90865
Residue:
288
  
Inhibitor
Name:
BDBM7461
Synonyms:
5,7-dihydroxy-2-phenyl-4H-chromen-4-one 5,7-dihydroxyflavone chrysin | cid_5281607
Type:
Small organic molecule
Emp. Form.:
C15H10O4
Mol. Mass.:
254.2375
SMILES:
Oc1cc(O)c2c(c1)oc(cc2=O)-c1ccccc1
: