Target
cAMP and cAMP-inhibited cGMP 3',5'-cyclic phosphodiesterase 10A
Ligand
BDBM50019113
Substrate
Meas. Tech.
ChEMBL_1361474 (CHEMBL3294350)
IC50
590±n/a nM
Citation
 Chino, AMasuda, NAmano, YHonbou, KMihara, TYamazaki, MTomishima, M Novel benzimidazole derivatives as phosphodiesterase 10A (PDE10A) inhibitors with improved metabolic stability. Bioorg Med Chem 22:3515-26 (2014)  
Target
Name:
cAMP and cAMP-inhibited cGMP 3',5'-cyclic phosphodiesterase 10A
Synonyms:
3',5'-cyclic phosphodiesterase PDE10A Phosphodiesterase 10 (PDE10) | Phosphodiesterase 10A
Type:
Protein
Mol. Mass.:
88412.52
Organism:
Homo sapiens (Human)
Description:
Q9Y233
Residue:
1055
  
Inhibitor
Name:
BDBM50019113
Synonyms:
CHEMBL3288408
Type:
Small organic molecule
Emp. Form.:
C24H22N4
Mol. Mass.:
366.4583
SMILES:
Cc1nc(CCc2nc3cc(C)ccc3n2-c2ccccc2)n2ccccc12
: