Target
cAMP and cAMP-inhibited cGMP 3',5'-cyclic phosphodiesterase 10A
Ligand
BDBM50019129
Substrate
Meas. Tech.
ChEMBL_1361474 (CHEMBL3294350)
IC50
9.5±n/a nM
Citation
 Chino, AMasuda, NAmano, YHonbou, KMihara, TYamazaki, MTomishima, M Novel benzimidazole derivatives as phosphodiesterase 10A (PDE10A) inhibitors with improved metabolic stability. Bioorg Med Chem 22:3515-26 (2014)  
Target
Name:
cAMP and cAMP-inhibited cGMP 3',5'-cyclic phosphodiesterase 10A
Synonyms:
3',5'-cyclic phosphodiesterase PDE10A Phosphodiesterase 10 (PDE10) | Phosphodiesterase 10A
Type:
Protein
Mol. Mass.:
88412.52
Organism:
Homo sapiens (Human)
Description:
Q9Y233
Residue:
1055
  
Inhibitor
Name:
BDBM50019129
Synonyms:
CHEMBL3288424
Type:
Small organic molecule
Emp. Form.:
C23H22N6O2
Mol. Mass.:
414.4598
SMILES:
COc1ccnc2n(c(CCn3c4nccc(C)c4n(C)c3=O)nc12)-c1ccccc1
: