Target
Prostaglandin G/H synthase 2
Ligand
BDBM50303448
Substrate
Meas. Tech.
ChEMBL_1362173 (CHEMBL3295182)
IC50
>10000±n/a nM
Citation
 Verhoff, MSeitz, SPaul, MNoha, SMJauch, JSchuster, DWerz, O Tetra- and pentacyclic triterpene acids from the ancient anti-inflammatory remedy frankincense as inhibitors of microsomal prostaglandin E(2) synthase-1. J Nat Prod 77:1445-51 (2014)  
Target
Name:
Prostaglandin G/H synthase 2
Synonyms:
COX2 Cyclooxygenase 2 (COX-2) Cyclooxygenase-2 (COX-2 AA) Cyclooxygenase-2 (COX-2) PGH2_HUMAN PHS II Prostaglandin E synthase/G/H synthase 2 Prostaglandin-endoperoxide synthase 2
Type:
Enzyme
Mol. Mass.:
69003.89
Organism:
Homo sapiens (Human)
Description:
Recombinant Cox-2 provided by Cayman (Cayman Chemical Co.,Ann Arbor, MI).
Residue:
604
  
Inhibitor
Name:
BDBM50303448
Synonyms:
Beta-elemonic acid | CHEMBL566929
Type:
Small organic molecule
Emp. Form.:
C30H46O3
Mol. Mass.:
454.6844
SMILES:
[#6]\[#6](-[#6])=[#6]\[#6]-[#6]-[#6@@H](-[#6@H]1-[#6]-[#6][C@]2([#6])[#6]-3=[#6](-[#6]-[#6][C@@]12[#6])[C@@]1([#6])[#6]-[#6]-[#6](=O)C([#6])([#6])[#6@H]1-[#6]-[#6]-3)-[#6](-[#8])=O
: