Target
Prostaglandin G/H synthase 2
Ligand
BDBM50019161
Substrate
Meas. Tech.
ChEMBL_1362173 (CHEMBL3295182)
IC50
>10000±n/a nM
Citation
 Verhoff, MSeitz, SPaul, MNoha, SMJauch, JSchuster, DWerz, O Tetra- and pentacyclic triterpene acids from the ancient anti-inflammatory remedy frankincense as inhibitors of microsomal prostaglandin E(2) synthase-1. J Nat Prod 77:1445-51 (2014)  
Target
Name:
Prostaglandin G/H synthase 2
Synonyms:
COX2 Cyclooxygenase 2 (COX-2) Cyclooxygenase-2 (COX-2 AA) Cyclooxygenase-2 (COX-2) PGH2_HUMAN PHS II Prostaglandin E synthase/G/H synthase 2 Prostaglandin-endoperoxide synthase 2
Type:
Enzyme
Mol. Mass.:
69003.89
Organism:
Homo sapiens (Human)
Description:
Recombinant Cox-2 provided by Cayman (Cayman Chemical Co.,Ann Arbor, MI).
Residue:
604
  
Inhibitor
Name:
BDBM50019161
Synonyms:
CHEMBL3289102
Type:
Small organic molecule
Emp. Form.:
C30H50O2
Mol. Mass.:
442.7168
SMILES:
[H][C@]12CC=C3[C@]4([H])[C@@H](C)[C@H](C)CC[C@]4(C)CC[C@@]3(C)[C@]1(C)CC[C@@H](C(C)C)[C@]2(C)CCC(O)=O
: