Target
Prostaglandin E synthase
Ligand
BDBM50019161
Substrate
Meas. Tech.
ChEMBL_1362163 (CHEMBL3295172)
IC50
>10000±n/a nM
Citation
 Verhoff, MSeitz, SPaul, MNoha, SMJauch, JSchuster, DWerz, O Tetra- and pentacyclic triterpene acids from the ancient anti-inflammatory remedy frankincense as inhibitors of microsomal prostaglandin E(2) synthase-1. J Nat Prod 77:1445-51 (2014)  
Target
Name:
Prostaglandin E synthase
Synonyms:
MGST1L1 PGES PTGES Prostaglandin E synthase (PGES-1) Prostaglandin E synthase-1 (PGES-1) Prostaglandin E2 synthase-1 ( mPGES-1)
Type:
Protein
Mol. Mass.:
17112.22
Organism:
Homo sapiens (Human)
Description:
Residue:
152
  
Inhibitor
Name:
BDBM50019161
Synonyms:
CHEMBL3289102
Type:
Small organic molecule
Emp. Form.:
C30H50O2
Mol. Mass.:
442.7168
SMILES:
[H][C@]12CC=C3[C@]4([H])[C@@H](C)[C@H](C)CC[C@]4(C)CC[C@@]3(C)[C@]1(C)CC[C@@H](C(C)C)[C@]2(C)CCC(O)=O
: