Target
Beta-3 adrenergic receptor
Ligand
BDBM25771
Substrate
Meas. Tech.
ChEMBL_1369178
EC50
1000±n/a nM
Citation
 McKinnell, RMKlein, ULinsell, MSMoran, EJNodwell, MBPfeiffer, JWThomas, GRYu, CJacobsen, JR Discovery of TD-4306, a long-actingß2-agonist for the treatment of asthma and COPD. Bioorg Med Chem Lett 24:2871-6 (2014)  
Target
Name:
Beta-3 adrenergic receptor
Synonyms:
ADRB3 ADRB3_HUMAN Beta-2 adrenergic receptor and beta-3 adrenergic receptor Beta-3 adrenoreceptor | adrenergic Beta3
Type:
G Protein-Coupled Receptor (GPCR)
Mol. Mass.:
43534.88
Organism:
Homo sapiens (Human)
Description:
Residue:
408
  
Inhibitor
Name:
BDBM25771
Synonyms:
1-hydroxy-2-naphthoic acid;4-[1-hydroxy-2-[6-(4-phenylbutoxy)hexylamino]ethyl]-2-methylol-phenol Aeromax Serevent | salmeterol xinafoate
Type:
Small organic molecule
Emp. Form.:
C25H37NO4
Mol. Mass.:
415.5656
SMILES:
OCc1cc(ccc1O)C(O)CNCCCCCCOCCCCc1ccccc1
: