Target
Muscarinic acetylcholine receptor M2
Ligand
BDBM50021928
Substrate
Meas. Tech.
ChEMBL_1367095
Ki
0.053000±n/a nM
Citation
 Nagashima, SMatsushima, YHamaguchi, HNagata, HKontani, TMoritomo, AKoshika, TTakeuchi, M Novel quinuclidinyl heteroarylcarbamate derivatives as muscarinic receptor antagonists. Bioorg Med Chem 22:3478-87 (2014)  
Target
Name:
Muscarinic acetylcholine receptor M2
Synonyms:
ACM2_RAT Chrm-2 | Chrm2
Type:
Enzyme Catalytic Domain
Mol. Mass.:
51555.53
Organism:
RAT
Description:
P10980
Residue:
466
  
Inhibitor
Name:
BDBM50021928
Synonyms:
CHEMBL3298599
Type:
Small organic molecule
Emp. Form.:
C18H21ClIN3O2S
Mol. Mass.:
505.801
SMILES:
[I-].C[N+]12CCC(CC1)(CC2)OC(=O)Nc1ncsc1-c1cccc(Cl)c1
: