Target
Muscarinic acetylcholine receptor M5
Ligand
BDBM50024562
Substrate
Meas. Tech.
ChEMBL_1437330 (CHEMBL3385425)
EC50
400±n/a nM
Citation
 Lindsley, CW 2013 Philip S. Portoghese Medicinal Chemistry Lectureship: drug discovery targeting allosteric sites. J Med Chem 57:7485-98 (2014)  
Target
Name:
Muscarinic acetylcholine receptor M5
Synonyms:
ACM5_HUMAN | CHRM5
Type:
PROTEIN
Mol. Mass.:
60102.35
Organism:
Homo sapiens (Human)
Description:
ChEMBL_1517990
Residue:
532
  
Inhibitor
Name:
BDBM50024562
Synonyms:
CHEMBL2431187
Type:
Small organic molecule
Emp. Form.:
C18H15FN2O2
Mol. Mass.:
310.3223
SMILES:
O[C@H]1C[C@@H](C1)NC(=O)c1ccc(cn1)C#Cc1cccc(F)c1
: