Target
Aminopeptidase N
Ligand
BDBM50316049
Substrate
Meas. Tech.
ChEMBL_1442054 (CHEMBL3373422)
Ki
0.790000±n/a nM
Citation
 Vassiliou, SWeglarz-Tomczak, EBerlicki, LPawelczak, MNocek, BMulligan, RJoachimiak, AMucha, A Structure-guided, single-point modifications in the phosphinic dipeptide structure yield highly potent and selective inhibitors of neutral aminopeptidases. J Med Chem 57:8140-51 (2014)  
Target
Name:
Aminopeptidase N
Synonyms:
AMPN_HUMAN APN Aminopeptidase CD_antigen=CD13 Myeloid plasma membrane glycoprotein CD13 gp150 | hAPN
Type:
PROTEIN
Mol. Mass.:
109522.63
Organism:
Homo sapiens (Human)
Description:
ChEMBL_1507526
Residue:
967
  
Inhibitor
Name:
BDBM50316049
Synonyms:
1-amino-3-phenylpropylphosphonic acid | CHEMBL1090914
Type:
Small organic molecule
Emp. Form.:
C9H14NO3P
Mol. Mass.:
215.1861
SMILES:
NC(CCc1ccccc1)P(O)(O)=O
: