Target
Aminopeptidase N
Ligand
BDBM50025066
Substrate
Meas. Tech.
ChEMBL_1442054 (CHEMBL3373422)
Ki
0.690000±n/a nM
Citation
 Vassiliou, SWeglarz-Tomczak, EBerlicki, LPawelczak, MNocek, BMulligan, RJoachimiak, AMucha, A Structure-guided, single-point modifications in the phosphinic dipeptide structure yield highly potent and selective inhibitors of neutral aminopeptidases. J Med Chem 57:8140-51 (2014)  
Target
Name:
Aminopeptidase N
Synonyms:
AMPN_HUMAN APN Aminopeptidase CD_antigen=CD13 Myeloid plasma membrane glycoprotein CD13 gp150 | hAPN
Type:
PROTEIN
Mol. Mass.:
109522.63
Organism:
Homo sapiens (Human)
Description:
ChEMBL_1507526
Residue:
967
  
Inhibitor
Name:
BDBM50025066
Synonyms:
CHEMBL3355109
Type:
Small organic molecule
Emp. Form.:
C20H27N2O4P
Mol. Mass.:
390.4131
SMILES:
NCc1ccc(CC(CP(O)(=O)C(N)CCc2ccccc2)C(O)=O)cc1
: