Target
ATP-binding cassette sub-family C member 8
Ligand
BDBM50025834
Substrate
Meas. Tech.
ChEMBL_1436733 (CHEMBL3385406)
Kd
0.380000±n/a nM
Citation
 Mascarello, AFrederico, MJCastro, AJMendes, CPDutra, MFWoehl, VMYunes, RAMena Barreto Silva, FRNunes, RJ Novel sulfonyl(thio)urea derivatives act efficiently both as insulin secretagogues and as insulinomimetic compounds. Eur J Med Chem 86:491-501 (2014)  
Target
Name:
ATP-binding cassette sub-family C member 8
Synonyms:
ABCC8 ATP-binding cassette sub-family C member 8 HRINS SUR Sulfonylurea receptor 1 | Sulfonylurea receptors
Type:
PROTEIN
Mol. Mass.:
177013.37
Organism:
Homo sapiens (Human)
Description:
ChEMBL_1436733
Residue:
1581
  
Inhibitor
Name:
BDBM50025834
Synonyms:
CHEMBL3330880
Type:
Small organic molecule
Emp. Form.:
C25H31ClN4O6S
Mol. Mass.:
551.055
SMILES:
COc1cc(NC(C)=O)c(Cl)cc1C(=O)NCCc1ccc(cc1)S(=O)(=O)NC(=O)NC1CCCCC1
: