Target
Isocitrate dehydrogenase [NADP] cytoplasmic
Ligand
BDBM50029488
Substrate
Meas. Tech.
ChEMBL_1436946 (CHEMBL3388444)
Ki
14000±n/a nM
Citation
 Liu, ZYao, YKogiso, MZheng, BDeng, LQiu, JJDong, SLv, HGallo, JMLi, XNSong, Y Inhibition of cancer-associated mutant isocitrate dehydrogenases: synthesis, structure-activity relationship, and selective antitumor activity. J Med Chem 57:8307-18 (2014)  
Target
Name:
Isocitrate dehydrogenase [NADP] cytoplasmic
Synonyms:
Cytosolic NADP-isocitrate dehydrogenase IDH1 IDP Isocitrate dehydrogenase 1 (IDH1) Oxalosuccinate decarboxylase | PICD
Type:
Protein
Mol. Mass.:
46661.29
Organism:
Homo sapiens (Human)
Description:
O75874
Residue:
414
  
Inhibitor
Name:
BDBM50029488
Synonyms:
CHEMBL3343462
Type:
Small organic molecule
Emp. Form.:
C20H19NO3
Mol. Mass.:
321.3698
SMILES:
COc1ccc(cc1)-c1ccc(Cc2cc(C)cc(=O)n2O)cc1
: