Target
Baculoviral IAP repeat-containing protein 2
Ligand
BDBM50030270
Substrate
Meas. Tech.
ChEMBL_1439912 (CHEMBL3388612)
IC50
2.0±n/a nM
Citation
 Kim, KSZhang, LWilliams, DPerez, HLStang, EBorzilleri, RMPosy, SLei, MChaudhry, CEmanuel, STalbott, R Discovery of tetrahydroisoquinoline-based bivalent heterodimeric IAP antagonists. Bioorg Med Chem Lett 24:5022-9 (2014)  
Target
Name:
Baculoviral IAP repeat-containing protein 2
Synonyms:
API1 BIRC2_HUMAN Cellular inhibitor of apoptosis 1 MIHB | RNF48
Type:
Protein
Mol. Mass.:
69900.47
Organism:
Homo sapiens (Human)
Description:
Q13490
Residue:
618
  
Inhibitor
Name:
BDBM50030270
Synonyms:
CHEMBL3339219 | US9783573, Example 23
Type:
Small organic molecule
Emp. Form.:
C60H79N11O9
Mol. Mass.:
1098.3376
SMILES:
CN[C@@H](C)C(=O)N[C@H](C(=O)N1C[C@H](C[C@H]1C(=O)N[C@@H]1CCCc2ccccc12)NC(=O)c1cnc(NC(=O)c2ccc3C[C@H](N(Cc3c2)C(=O)[C@@H](NC(=O)[C@H](C)NC)C(C)(C)C)C(=O)N[C@@H]2CCCc3ccccc23)o1)C(C)(C)C
: