Target
DNA-(apurinic or apyrimidinic site) endonuclease
Ligand
BDBM50436204
Substrate
Meas. Tech.
ChEMBL_1439941 (CHEMBL3389217)
IC50
110±n/a nM
Citation
 Kaur, GCholia, RPMantha, AKKumar, R DNA repair and redox activities and inhibitors of apurinic/apyrimidinic endonuclease 1/redox effector factor 1 (APE1/Ref-1): a comparative analysis and their scope and limitations toward anticancer drug development. J Med Chem 57:10241-56 (2014)  
Target
Name:
DNA-(apurinic or apyrimidinic site) endonuclease
Synonyms:
APE APEX APEX1_HUMAN Apurinic-apyrimidinic endonuclease 1 (APE-1) DNA-(apurinic or apyrimidinic site) lyase REF1
Type:
Protein
Mol. Mass.:
35560.12
Organism:
Homo sapiens (Human)
Description:
P27695
Residue:
318
  
Inhibitor
Name:
BDBM50436204
Synonyms:
CHEMBL109037
Type:
Small organic molecule
Emp. Form.:
C9H11NO5
Mol. Mass.:
213.1873
SMILES:
NC(Cc1cc(O)c(O)cc1O)C(O)=O
: