Target
Collagenase 3
Ligand
BDBM16596
Substrate
Meas. Tech.
ChEMBL_1434999 (CHEMBL3387083)
IC50
110±n/a nM
Citation
 Spicer, TPJiang, JTaylor, ABChoi, JYHart, PJRoush, WRFields, GBHodder, PSMinond, D Characterization of selective exosite-binding inhibitors of matrix metalloproteinase 13 that prevent articular cartilage degradation in vitro. J Med Chem 57:9598-611 (2014)  
Target
Name:
Collagenase 3
Synonyms:
MMP-13 MMP13_HUMAN Matrix metalloproteinase-13 (MMP-13) | Matrix metalloproteinase-13 (MMP13)
Type:
Enzyme
Mol. Mass.:
53808.06
Organism:
Homo sapiens (Human)
Description:
P45452
Residue:
471
  
Inhibitor
Name:
BDBM16596
Synonyms:
4-N,6-N-bis[(4-fluoro-3-methylphenyl)methyl]pyrimidine-4,6-dicarboxamide MMP Inhibitor, 4 Pyrimidine Dicarboxamide Inhibitor, 4
Type:
Small organic molecule
Emp. Form.:
C22H20F2N4O2
Mol. Mass.:
410.4166
SMILES:
Cc1cc(CNC(=O)c2cc(ncn2)C(=O)NCc2ccc(F)c(C)c2)ccc1F
: