Target
Carbonic anhydrase 13
Ligand
BDBM50031589
Substrate
Meas. Tech.
ChEMBL_1441659 (CHEMBL3377636)
Kd
130±n/a nM
Target
Name:
Carbonic anhydrase 13
Synonyms:
CA13 Carbonic anhydrase Carbonic anhydrase XIII (CA XIII)
Type:
Enzyme
Mol. Mass.:
29445.78
Organism:
Homo sapiens (Human)
Description:
Q8N1Q1
Residue:
262
  
Inhibitor
Name:
BDBM50031589
Synonyms:
CHEMBL3359179
Type:
Small organic molecule
Emp. Form.:
C16H23F3N2O3S2
Mol. Mass.:
412.491
SMILES:
NS(=O)(=O)c1c(F)c(F)c(SCCO)c(F)c1NC1CCCCCCC1
: