Target
Suppressor of tumorigenicity 14 protein
Ligand
BDBM50063698
Substrate
Meas. Tech.
ChEMBL_1432691 (CHEMBL3389935)
Ki
0.020000±n/a nM
Citation
 Han, ZHarris, PKJones, DEChugani, RKim, TAgarwal, MShen, WWildman, SAJanetka, JW Inhibitors of HGFA, Matriptase, and Hepsin Serine Proteases: A Nonkinase Strategy to Block Cell Signaling in Cancer. ACS Med Chem Lett 5:1219-24 (2014)  
Target
Name:
Suppressor of tumorigenicity 14 protein
Synonyms:
Epithin MT-SP1 PRSS14 SNC19 ST14_HUMAN Suppressor of tumorigenicity 14 protein TADG15
Type:
Single-pass type II membrane protein
Mol. Mass.:
94769.23
Organism:
Homo sapiens (Human)
Description:
Q9Y5Y6
Residue:
855
  
Inhibitor
Name:
BDBM50063698
Synonyms:
4-Guanidino-benzoic acid 6-carbamimidoyl-naphthalen-2-yl ester CHEMBL273264 | Nafamostat
Type:
Small organic molecule
Emp. Form.:
C19H17N5O2
Mol. Mass.:
347.3706
SMILES:
[#7]\[#6](-[#7])=[#7]/c1ccc(cc1)-[#6](=O)-[#8]-c1ccc2cc(ccc2c1)-[#6](-[#7])=[#7]
: