Target
Carbonic anhydrase 2
Ligand
BDBM50035684
Substrate
Meas. Tech.
ChEMBL_1434386 (CHEMBL3387073)
Ki
4.8±n/a nM
Citation
 Abdel-Aziz, AAEl-Azab, ASCeruso, MSupuran, CT Carbonic anhydrase inhibitory activity of sulfonamides and carboxylic acids incorporating cyclic imide scaffolds. Bioorg Med Chem Lett 24:5185-9 (2014)  
Target
Name:
Carbonic anhydrase 2
Synonyms:
CA-II CAC Carbonate dehydratase II Carbonic anhydrase 2 (CA-II) Carbonic anhydrase C Carbonic anhydrase II (CA-II) Carbonic anhydrase II (hCA II) | Carbonic anhydrase isoenzyme II (hCA II)
Type:
Enzyme
Mol. Mass.:
29250.71
Organism:
Homo sapiens (Human)
Description:
P00918
Residue:
260
  
Inhibitor
Name:
BDBM50035684
Synonyms:
CHEMBL2377784
Type:
Small organic molecule
Emp. Form.:
C14H14N2O4S
Mol. Mass.:
306.337
SMILES:
[H][C@@]12CC=CC[C@]1([H])C(=O)N(C2=O)c1ccc(cc1)S(N)(=O)=O
: