Target
Carbonic anhydrase 9
Ligand
BDBM50035674
Substrate
Meas. Tech.
ChEMBL_1434387 (CHEMBL3387074)
Ki
2.6±n/a nM
Citation
 Abdel-Aziz, AAEl-Azab, ASCeruso, MSupuran, CT Carbonic anhydrase inhibitory activity of sulfonamides and carboxylic acids incorporating cyclic imide scaffolds. Bioorg Med Chem Lett 24:5185-9 (2014)  
Target
Name:
Carbonic anhydrase 9
Synonyms:
CA-IX CAH9_HUMAN Carbonic anhydrase 9 (CA IX) Carbonic anhydrase 9 precursor Carbonic anhydrase IX (CAIX) Carbonic anhydrases; II & IX MN RCC-associated antigen G250
Type:
Enzyme
Mol. Mass.:
49669.03
Organism:
Homo sapiens (Human)
Description:
Catalytic domain of human cloned isozyme was used in the assay
Residue:
459
  
Inhibitor
Name:
BDBM50035674
Synonyms:
CHEMBL2377770
Type:
Small organic molecule
Emp. Form.:
C14H6Cl4N2O4S
Mol. Mass.:
440.085
SMILES:
NS(=O)(=O)c1ccc(cc1)N1C(=O)c2c(C1=O)c(Cl)c(Cl)c(Cl)c2Cl
: