Target
Carbonic anhydrase 12
Ligand
BDBM50035681
Substrate
Meas. Tech.
ChEMBL_1434388 (CHEMBL3387075)
Ki
0.850000±n/a nM
Citation
 Abdel-Aziz, AAEl-Azab, ASCeruso, MSupuran, CT Carbonic anhydrase inhibitory activity of sulfonamides and carboxylic acids incorporating cyclic imide scaffolds. Bioorg Med Chem Lett 24:5185-9 (2014)  
Target
Name:
Carbonic anhydrase 12
Synonyms:
CA-XII CAH12_HUMAN Carbonic anhydrase Carbonic anhydrase XII Carbonic anhydrase XII (CAXII) | Tumor antigen HOM-RCC-3.1.3
Type:
Enzyme
Mol. Mass.:
39456.00
Organism:
Homo sapiens (Human)
Description:
Catalytic domain of human cloned isozyme was used in the assay
Residue:
354
  
Inhibitor
Name:
BDBM50035681
Synonyms:
CHEMBL2377787
Type:
Small organic molecule
Emp. Form.:
C16H14N2O4S
Mol. Mass.:
330.358
SMILES:
Cc1ccc2C(=O)N(Cc3ccc(cc3)S(N)(=O)=O)C(=O)c2c1
: