Target
Carbonic anhydrase 12
Ligand
BDBM50035692
Substrate
Meas. Tech.
ChEMBL_1434388 (CHEMBL3387075)
Ki
2.7±n/a nM
Citation
 Abdel-Aziz, AAEl-Azab, ASCeruso, MSupuran, CT Carbonic anhydrase inhibitory activity of sulfonamides and carboxylic acids incorporating cyclic imide scaffolds. Bioorg Med Chem Lett 24:5185-9 (2014)  
Target
Name:
Carbonic anhydrase 12
Synonyms:
CA-XII CAH12_HUMAN Carbonic anhydrase Carbonic anhydrase XII Carbonic anhydrase XII (CAXII) | Tumor antigen HOM-RCC-3.1.3
Type:
Enzyme
Mol. Mass.:
39456.00
Organism:
Homo sapiens (Human)
Description:
Catalytic domain of human cloned isozyme was used in the assay
Residue:
354
  
Inhibitor
Name:
BDBM50035692
Synonyms:
CHEMBL2377791
Type:
Small organic molecule
Emp. Form.:
C18H18N2O4S
Mol. Mass.:
358.412
SMILES:
CC(C)(C)c1ccc2C(=O)N(C(=O)c2c1)c1ccc(cc1)S(N)(=O)=O
: