Target
Prostaglandin G/H synthase 2
Ligand
BDBM50035939
Substrate
Meas. Tech.
ChEMBL_1436537 (CHEMBL3382316)
IC50
6500±n/a nM
Citation
 Alegaon, SGHirpara, MBAlagawadi, KRHullatti, KKKashniyal, K Synthesis of novel pyrazole?thiadiazole hybrid as potential potent and selective cyclooxygenase-2 (COX-2) inhibitors. Bioorg Med Chem Lett 24:5324-9 (2015)  
Target
Name:
Prostaglandin G/H synthase 2
Synonyms:
COX2 Cyclooxygenase-2 (COX-2) PTGS2 Prostaglandin G/H synthase (cyclooxygenase)
Type:
Protein
Mol. Mass.:
68976.98
Organism:
Ovis aries (Sheep)
Description:
Residue:
603
  
Inhibitor
Name:
BDBM50035939
Synonyms:
CHEMBL3338733
Type:
Small organic molecule
Emp. Form.:
C27H22BrN5O2S
Mol. Mass.:
560.465
SMILES:
CC(=O)N(C1=NN(C(S1)c1cn(nc1-c1ccc(Br)cc1)-c1ccccc1)C(C)=O)c1ccccc1
: