Target
Prostaglandin G/H synthase 2
Ligand
BDBM50035975
Substrate
Meas. Tech.
ChEMBL_1436537 (CHEMBL3382316)
IC50
2330±n/a nM
Citation
 Alegaon, SGHirpara, MBAlagawadi, KRHullatti, KKKashniyal, K Synthesis of novel pyrazole?thiadiazole hybrid as potential potent and selective cyclooxygenase-2 (COX-2) inhibitors. Bioorg Med Chem Lett 24:5324-9 (2015)  
Target
Name:
Prostaglandin G/H synthase 2
Synonyms:
COX2 Cyclooxygenase-2 (COX-2) PTGS2 Prostaglandin G/H synthase (cyclooxygenase)
Type:
Protein
Mol. Mass.:
68976.98
Organism:
Ovis aries (Sheep)
Description:
Residue:
603
  
Inhibitor
Name:
BDBM50035975
Synonyms:
CHEMBL3338729
Type:
Small organic molecule
Emp. Form.:
C21H18ClN5O2S
Mol. Mass.:
439.918
SMILES:
CC(=O)NC1=NN(C(S1)c1cn(nc1-c1ccc(Cl)cc1)-c1ccccc1)C(C)=O
: